Longshore and Harbor Workers’ Compensation Act Claim
type: Class
alternative label: 长岸和港口工人赔偿法索赔
subclass of: R9LVBKjvGRuzwgtlhuLST36
subclass of: RD22PX6hiObnrRSM3c6bXdR
subclass of: RqHLQbqYW16CtZ6TSKOZPz
definition: A claim made under the Longshore and Harbor Workers’ Compensation Act (LHWCA), which provides benefits to certain maritime workers who are injured or become ill while working on navigable waters or in adjoining areas used for loading, unloading, repairing, or building a vessel.