Georgia District Court - Fulton County
type: Class
subclass of: RBxw7BF15bDA0Ifn2vOrC8h
definition: Georgia District Court - Fulton County: A specific court within the Georgia District Court system that has jurisdiction over legal matters within Fulton County.