Georgia Superior Court - Wilkinson County
type: Class
subclass of: RCBE5bLTCIia7wAstjMsnKO
definition: Georgia Superior Court - Wilkinson County: A court of general jurisdiction in the state of Georgia that has authority over legal matters within Wilkinson County.