Unlawful Detainer
type: Class
alternative label: 非法拘留
subclass of: R97svnIdQhrkKZw6i3Nn88z
subclass of: RDSBerlLWg1ntpLqDQn1eVn
definition: An unlawful detainer is a summary proceeding for a landlord to recover possession of a leased premises from a tenant wrongfully withholding or "detaining" the property.