Hematology Malpractice
type: Class
alternative label: 血液病医疗事故
subclass of: R8nVhrBlasGIc7jxw1D0vbm
definition: Medical negligence related to the diagnosis, treatment, or management of blood disorders or diseases.