Kurukh
type: Class
alternative label: 库鲁克语
subclass of: RDOvAHsvY8TKJ1O1orXPM9o
definition: Kurukh (Language) is a specific written or spoken structured system of communication that consists of grammar and vocabulary, and is a member of the Language top-level class.