Motion for Summary Adjudication
type: Class
alternative label: 裁定摘要动议
subclass of: R9Ii4OzSADsjS0VegX12oQJ
subclass of: RUM0A3dwvk0A2dp3WHxNrj
definition: A Motion for Summary Adjudication is a legal request made by a party in a bankruptcy or civil case, asking the court to rule in their favor without a trial, based on the evidence presented in the motion.