Arkansas Circuit Court - Saline Cty.
type: Class
subclass of: RCEWWtS3nM8GE8R4en1abRz
definition: A court located in Saline County, Arkansas that has jurisdiction over certain legal matters within its designated area.