Mi'kmaq; Micmac
type: Class
alternative label: 米克马克人
subclass of: RDOvAHsvY8TKJ1O1orXPM9o
definition: A Native American language spoken by the Mi'kmaq people in Eastern Canada and Northeastern United States.