Motion to Intervene
type: Class
alternative label: 干涉动议
subclass of: R8yPMgoH5NMUuEp5UXPgmZo
subclass of: R9Ii4OzSADsjS0VegX12oQJ
subclass of: RBFH5v175MuTKvLEcBLRkJ4
subclass of: RfdN15c44dyYEkhB4tR9Hu
definition: A Motion to Intervene is a legal request made by a non-party to join an ongoing case in order to protect their interests or rights.