Certificate of Service of Tax Information to Requestor
type: Class
alternative label: 向请求者提供税务信息的服务证书
subclass of: RD9WAxaa5KjWQ8QaRPEivN
definition: A Certificate of Service of Tax Information to Requestor is a written document that confirms the delivery of tax information to the person who requested it.