Homestead Exemption
type: Class
alternative label: 农场
subclass of: RBuPVAcB52MFzxOD0Ov56jq
definition: In a homestead exemption, a property is protected from being sold to pay off debts in a bankruptcy case, as it is considered essential for the debtor's basic needs and livelihood.