Buyer Consent Requirement Application
type: Class
alternative label: 买方同意要求应用
subclass of: R7J7NYI0WlIIflyMEgnXHIq
definition: A Buyer Consent Requirement Application is a specific instance where a buyer's consent is necessary for the execution of a negative covenant, either for all negative covenants or only for specified ones.