CFIUS Covenant
type: Class
alternative label: CFIUS契约
subclass of: R8S6XHMUuU5cg5gdDri7LuL
definition: A CFIUS Covenant is a provision in a legal agreement that outlines the conditions and requirements for approval by the Committee on Foreign Investment in the United States (CFIUS) for a foreign investment in a US company.