Reasonable Suspicion
type: Class
alternative label: 合理怀疑
subclass of: RDV74m3ydS2I72hZ88Mf1RX
definition: Reasonable Suspicion is a legal standard that requires an officer to have a belief, based on specific and articulable facts, that a person is involved in criminal activity or is about to be involved in criminal activity.