Subrogation Clause
type: Class
alternative label: 代位权条款
subclass of: RDe0RKU39BlhcyACJW30ZLc
definition: A subrogation clause is a provision in a contract that allows one party to step into the shoes of another party and assume their legal rights and remedies in the event of a loss or damage.