Pennsylvania District and County Court
type: Class
subclass of: R91022a673f1f545e1e8D4e7
definition: A Pennsylvania District and County Court is a court within the Pennsylvania State Courts system that has jurisdiction over cases within a specific district or county.