SBA Office of Advocacy
type: Class
alternative label: SBA倡导办公室
subclass of: RD34a04CAEcddBDE956309da
hidden label: SBAOA
definition: The Office of Advocacy of the U.S. Small Business Administration represents the views of small business to Congress, the White House, federal agencies, federal courts, and state policymakers.