Krapinsko-zagorska zupanija
type: Class
alternative label: HR+02
subclass of: RD376568768e2A38500CEb1b
hidden label: HR+02
definition: Krapinsko-zagorska zupanija is a region in Croatia, located in the northwestern part of the country.