Maritime
type: Class
alternative label: subdivision of Togo
alternative label: TG+M
subclass of: R8E9d223223f2D213d2DBbd6
hidden label: TG+M
definition: A subdivision of Togo located along its southern coast, encompassing the Gulf of Guinea and its associated islands.