Al Hudud ash Shamaliyah
type: Class
alternative label: SA+08
subclass of: RA1D98e5DF6deF34c00FC3a0
hidden label: SA+08
definition: A region in the northern part of Saudi Arabia, also known as "Al Hudud ash Shamaliyah", with SA+08 as its code.