Consumer Fraud
type: Class
alternative label: 消费者欺诈
subclass of: R7MsH9WtTPf14W1GB1m8zrB
subclass of: R8GyyJdxlZtc7PsW9vLAKfE
definition: Consumer Fraud refers to the deceptive or misleading practices used by businesses or individuals to gain an unfair advantage over consumers, often resulting in financial harm or injury.