Order for Protection
type: Class
alternative label: 保护令
subclass of: RCQJU54O6qCvotCfmDwYZwj
subclass of: RDmsvdtBrrw46UnCDJ0LKrJ
definition: A court-issued directive intended to protect a person from harm or harassment by another individual, typically in cases involving domestic violence or stalking.