U.S. Military Courts
type: Class
alternative label: 美国军事法庭
subclass of: R58Ea9fA3C655E9C742D17b3
subclass of: RF52f1c417a596A01b36Bcf0
subclass of: RnSHqIE6kW486gQwcgL03v
hidden label: MILCUS
definition: U.S. Military Courts are specialized courts within the U.S. Department of Defense that have jurisdiction over criminal and administrative proceedings involving members of the armed forces.