Personal and Laundry Services Industry
type: Class
alternative label: 个人和洗衣服务行业
subclass of: RBsVax4c8Bdvzok8MTZKGD8
hidden label: PLNS
definition: Industries in the Personal and Laundry Services industry group provide personal and laundry services to individuals, households, and businesses. Services performed include: personal care services; death care services; laundry and dry cleaning services; and a wide range of other personal services, such as pet care (except veterinary) services, photofinishing services, temporary parking services, and dating services.,Industries in the Personal and Laundry Services industry group provide personal and laundry services to individuals, households, and businesses. Services performed include: personal care services; death care services; laundry and drycleaning services; and a wide range of other personal services, such as pet care (except veterinary) services, photofinishing services, temporary parking services, and dating services.