Motion for Approval of Sale Procedures
type: Class
alternative label: 销售程序批准动议
subclass of: R9Ii4OzSADsjS0VegX12oQJ
definition: A Motion for Approval of Sale Procedures is a formal request made in a bankruptcy case seeking court approval of the procedures for selling assets of the debtor.