Notice
type: Class
alternative label: 通知
subclass of: R7zvYKadqTXgMZV8ghLsloR
subclass of: RBgYlfvGoXoGLN1CBxDQW6B
definition: A Notice is a written or recorded communication that informs a party of a legal action or proceeding, such as a hearing, trial, or motion, and is typically filed with a court or served on the parties involved.