Contract Termination
type: Class
preferred label: Agreement Termination
alternative label: Contract Cancellation
alternative label: Contract Dissolution
alternative label: Termination Of Contract
subclass of: RdfKnWpXsG2eBmnS3oJNTF
definition: Contract Termination is an event that occurs when a contract is ended, either at or before its natural expiration date. Termination can be mutual, by breach, or by operation of law.