Mongo
type: Class
subclass of: RDOvAHsvY8TKJ1O1orXPM9o
definition: Mongo (Language) is a specific written or spoken structured system of communication that consists of grammar and vocabulary, and is a subcategory of the Language class in the context of legal matters.