Motion to Present Oral Argument by Video
type: Class
alternative label: 通过视频提出口头辩论动议
subclass of: R8yPMgoH5NMUuEp5UXPgmZo
subclass of: R8zwKGkogGKIKWSVWb1ItRL
subclass of: R9Zr3p1tJH4I9nJWtNMVz5I
definition: A Motion to Present Oral Argument by Video is a request made in a trial court to allow a party to present their argument through a video conference instead of appearing in person.