Pooling and Servicing Agreement
type: Class
subclass of: R7p3ZBGzc1BxDrCwYJnsTo
definition: A Pooling and Servicing Agreement sets the rights, obligations, and responsibilities of the parties involved in a securitization, especially concerning the collection and distribution of cash flows from pooled assets, typically loans.