Wilayah Persekutuan Putrajaya
type: Class
alternative label: MY+16
subclass of: RAF7c6aA0D26e3DF9984F231
hidden label: MY+16
definition: Wilayah Persekutuan Putrajaya is a federal territory in Malaysia.