Texas County Court
type: Class
subclass of: R2EC1c99BF7dfEC46b7E320f
definition: A Texas County Court is a court of limited jurisdiction within the Texas State Courts system that handles civil and criminal cases at the county level.