Motion to File Objections
type: Class
alternative label: 提出异议的动议
subclass of: R8xekNn7K6SxToo5ArjIsTX
definition: A Motion to File Objections is a formal request made to a court or other legal authority to allow a party to submit written objections to a particular issue or document in a case.