Salary
type: Class
subclass of: R8aNhIN6jIIVcj5Cbh8Bduw
subclass of: R9QN0xnYI5Hase8OfxFx2Nd
definition: A salary is a fixed regular payment given to an employee for their work, often on a monthly or biweekly basis, regardless of the number of hours worked. It signifies the agreed-upon compensation for a specific job or role within an organization