Kansas District Court - Cherokee County
type: Class
subclass of: R8ahGaNbVpIwATBsrRg3EZp
definition: Kansas District Court - Cherokee County is a specific court within the Kansas District Court system that has jurisdiction over legal matters within Cherokee County, Kansas.