DEPRECATED: Provider ID
type: Class
alternative label: Replaced by Vendor ID
subclass of: R8H8cpx25KBk3kH55YwSdDv
definition: Deprecated Provider ID refers to an outdated identifier for a service provider that has been replaced by the Vendor ID.