Eastern Frisian
type: Class
alternative label: 东弗里西亚语
subclass of: RDOvAHsvY8TKJ1O1orXPM9o
definition: Eastern Frisian is a structured system of communication that belongs to the group of languages and is spoken in a specific region.