Going and Coming Rule
type: Class
alternative label: 往返规则
subclass of: RCzs34uEQI9f4cuWp3bQO0P
definition: The going and coming rule prevents employer from being vicariously liable, absent certain exceptions, when an employee is going to, or coming from, work.