Egyptian
type: Class
alternative label: 埃及的
subclass of: RDOvAHsvY8TKJ1O1orXPM9o
definition: The Egyptian (Ancient) (Language) concept refers to the written or spoken structured system of communication used in ancient Egypt, consisting of its own unique grammar and vocabulary.