Indiana Circuit Court - Vanderburgh County
type: Class
subclass of: RCeiXNGpqL4H3jo1g1NobSm
definition: The Indiana Circuit Court - Vanderburgh County is a specific court within the Indiana Circuit Court system that has jurisdiction over legal matters within Vanderburgh County.