Educational Services Industry
type: Class
alternative label: 教育服务行业
subclass of: RDIwFaFcH4KY0gwEY0QlMTp
hidden label: EDU
definition: The Educational Services industry group comprises establishments that provide instruction and training in a wide variety of subjects. This instruction and training is provided by specialized establishments, such as schools, colleges, universities, and training centers. These establishments may be privately owned and operated for profit or not for profit, or they may be publicly owned and operated.