Temp Placement Management
type: Class
subclass of: RBQDXR2Gnn6virD8cjpZyWV
definition: Temp Placement Management refers to the management of temporary employees, including their recruitment, hiring, training, and supervision, within the context of overall people management.