Corporate Governance Law
type: Class
alternative label: 公司治理法
subclass of: RF0Bb0267149dFC8b5e349a1
hidden label: CGOV
definition: Mechanisms, processes, and relations by which corporations are controlled and operated.