"Acquisition Proposal" Language
type: Class
alternative label: 收购提案
subclass of: R82ikX2gSG3Kyc0OXqOpZve
subclass of: R8t29mcCgDnprofEh5VP2LX
subclass of: RCDa7IsUxl4AA7e5KylzJYK
definition: Acquisition Proposal Language refers to the specific terms and conditions included in a proposal for the acquisition of a company, which may trigger fiduciary exceptions, tail period fee triggers, or breakup fee triggers in a no-shop covenant.