Prima Facie
type: Class
alternative label: Prima facie
subclass of: RDV74m3ydS2I72hZ88Mf1RX
definition: A legal concept that refers to evidence that is sufficient to establish a fact or case unless it is rebutted or disproved by other evidence.