Appraisal
type: Class
alternative label: 评估
subclass of: R73Uo5x4VyfiOXt6i4R256t
subclass of: RdfKnWpXsG2eBmnS3oJNTF
definition: Appraisal refers to the process of determining the value of a property or asset, and is a type of event that can occur within the context of litigation or a transaction.