Account Stated
type: Class
alternative label: 账户陈述
subclass of: RBlW5OLfCbqfO3PmxrRqwG
subclass of: RZ1dOPJ6HH6lMJGSLNxfwV
definition: An account stated is a legal claim that arises when two parties have agreed on the amount of a debt owed and the debtor has promised to pay it. It falls under the category of contract and quasi-contract claims.