Bali
type: Class
alternative label: ID+BA
subclass of: R4D912d7BF1522F346a04278
hidden label: ID+BA
definition: Bali is an Indonesian island known for its beautiful beaches, coral reefs, and cultural landmarks.