De Novo
type: Class
subclass of: RCpnqQCzeexk3k9kkbLx1Zu
definition: A de novo review is a type of appellate review where the reviewing court considers the matter anew, without giving deference to the lower court's decision.